name,code,total,translated,translated_percent,translated_words_percent,total_words,translated_words,total_chars,translated_chars,translated_chars_percent,failing,failing_percent,fuzzy,fuzzy_percent,url_translate,url,translate_url,last_change,last_author,recent_changes,readonly,readonly_percent,approved,approved_percent,suggestions,comments
Afrikaans,af,3,0,0.0,0.0,21,0,124,0,0.0,0,0.0,0,0.0,,https://weblate.rob006.net/projects/flarum/justoverclock-random-post/af/,https://weblate.rob006.net/translate/flarum/justoverclock-random-post/af/,,,0,0,0.0,0,0.0,0,0
Arabic,ar,3,0,0.0,0.0,21,0,124,0,0.0,0,0.0,0,0.0,,https://weblate.rob006.net/projects/flarum/justoverclock-random-post/ar/,https://weblate.rob006.net/translate/flarum/justoverclock-random-post/ar/,,,0,0,0.0,0,0.0,0,0
Asturian,ast,3,0,0.0,0.0,21,0,124,0,0.0,0,0.0,0,0.0,,https://weblate.rob006.net/projects/flarum/justoverclock-random-post/ast/,https://weblate.rob006.net/translate/flarum/justoverclock-random-post/ast/,,,0,0,0.0,0,0.0,0,0
Azerbaijani,az,3,0,0.0,0.0,21,0,124,0,0.0,0,0.0,0,0.0,,https://weblate.rob006.net/projects/flarum/justoverclock-random-post/az/,https://weblate.rob006.net/translate/flarum/justoverclock-random-post/az/,,,0,0,0.0,0,0.0,0,0
Belarusian,be,3,0,0.0,0.0,21,0,124,0,0.0,0,0.0,0,0.0,,https://weblate.rob006.net/projects/flarum/justoverclock-random-post/be/,https://weblate.rob006.net/translate/flarum/justoverclock-random-post/be/,,,0,0,0.0,0,0.0,0,0
Bulgarian,bg,3,3,100.0,100.0,21,21,124,124,100.0,0,0.0,0,0.0,,https://weblate.rob006.net/projects/flarum/justoverclock-random-post/bg/,https://weblate.rob006.net/translate/flarum/justoverclock-random-post/bg/,2023-08-08 20:13:24.891894+00:00,,3,0,0.0,0,0.0,0,0
Bengali,bn,3,0,0.0,0.0,21,0,124,0,0.0,0,0.0,0,0.0,,https://weblate.rob006.net/projects/flarum/justoverclock-random-post/bn/,https://weblate.rob006.net/translate/flarum/justoverclock-random-post/bn/,,,0,0,0.0,0,0.0,0,0
Breton,br,3,0,0.0,0.0,21,0,124,0,0.0,0,0.0,0,0.0,,https://weblate.rob006.net/projects/flarum/justoverclock-random-post/br/,https://weblate.rob006.net/translate/flarum/justoverclock-random-post/br/,,,0,0,0.0,0,0.0,0,0
Catalan,ca,3,0,0.0,0.0,21,0,124,0,0.0,0,0.0,0,0.0,,https://weblate.rob006.net/projects/flarum/justoverclock-random-post/ca/,https://weblate.rob006.net/translate/flarum/justoverclock-random-post/ca/,,,0,0,0.0,0,0.0,0,0
Kurdish (Central),ckb,3,0,0.0,0.0,21,0,124,0,0.0,0,0.0,0,0.0,,https://weblate.rob006.net/projects/flarum/justoverclock-random-post/ckb/,https://weblate.rob006.net/translate/flarum/justoverclock-random-post/ckb/,,,0,0,0.0,0,0.0,0,0
Czech,cs,3,0,0.0,0.0,21,0,124,0,0.0,0,0.0,0,0.0,,https://weblate.rob006.net/projects/flarum/justoverclock-random-post/cs/,https://weblate.rob006.net/translate/flarum/justoverclock-random-post/cs/,,,0,0,0.0,0,0.0,0,0
Welsh,cy,3,0,0.0,0.0,21,0,124,0,0.0,0,0.0,0,0.0,,https://weblate.rob006.net/projects/flarum/justoverclock-random-post/cy/,https://weblate.rob006.net/translate/flarum/justoverclock-random-post/cy/,,,0,0,0.0,0,0.0,0,0
Danish,da,3,0,0.0,0.0,21,0,124,0,0.0,0,0.0,0,0.0,,https://weblate.rob006.net/projects/flarum/justoverclock-random-post/da/,https://weblate.rob006.net/translate/flarum/justoverclock-random-post/da/,,,0,0,0.0,0,0.0,0,0
German,de,3,3,100.0,100.0,21,21,124,124,100.0,0,0.0,0,0.0,,https://weblate.rob006.net/projects/flarum/justoverclock-random-post/de/,https://weblate.rob006.net/translate/flarum/justoverclock-random-post/de/,2022-05-04 14:40:49.485636+00:00,,4,0,0.0,0,0.0,0,0
German (formal),de@formal,3,0,0.0,0.0,21,0,124,0,0.0,0,0.0,0,0.0,,https://weblate.rob006.net/projects/flarum/justoverclock-random-post/de@formal/,https://weblate.rob006.net/translate/flarum/justoverclock-random-post/de@formal/,,,0,0,0.0,0,0.0,0,0
Greek,el,3,0,0.0,0.0,21,0,124,0,0.0,0,0.0,0,0.0,,https://weblate.rob006.net/projects/flarum/justoverclock-random-post/el/,https://weblate.rob006.net/translate/flarum/justoverclock-random-post/el/,,,0,0,0.0,0,0.0,0,0
English,en,3,3,100.0,100.0,21,21,124,124,100.0,0,0.0,0,0.0,,https://weblate.rob006.net/projects/flarum/justoverclock-random-post/en/,https://weblate.rob006.net/translate/flarum/justoverclock-random-post/en/,,,0,3,100.0,0,0.0,0,0
Esperanto,eo,3,0,0.0,0.0,21,0,124,0,0.0,0,0.0,0,0.0,,https://weblate.rob006.net/projects/flarum/justoverclock-random-post/eo/,https://weblate.rob006.net/translate/flarum/justoverclock-random-post/eo/,,,0,0,0.0,0,0.0,0,0
Spanish,es,3,0,0.0,0.0,21,0,124,0,0.0,0,0.0,0,0.0,,https://weblate.rob006.net/projects/flarum/justoverclock-random-post/es/,https://weblate.rob006.net/translate/flarum/justoverclock-random-post/es/,,,0,0,0.0,0,0.0,0,0
Spanish (formal),es@formal,3,0,0.0,0.0,21,0,124,0,0.0,0,0.0,0,0.0,,https://weblate.rob006.net/projects/flarum/justoverclock-random-post/es@formal/,https://weblate.rob006.net/translate/flarum/justoverclock-random-post/es@formal/,,,0,0,0.0,0,0.0,0,0
Spanish (Argentina),es_AR,3,0,0.0,0.0,21,0,124,0,0.0,0,0.0,0,0.0,,https://weblate.rob006.net/projects/flarum/justoverclock-random-post/es_AR/,https://weblate.rob006.net/translate/flarum/justoverclock-random-post/es_AR/,,,0,0,0.0,0,0.0,0,0
Estonian,et,3,0,0.0,0.0,21,0,124,0,0.0,0,0.0,0,0.0,,https://weblate.rob006.net/projects/flarum/justoverclock-random-post/et/,https://weblate.rob006.net/translate/flarum/justoverclock-random-post/et/,,,0,0,0.0,0,0.0,0,0
Basque,eu,3,0,0.0,0.0,21,0,124,0,0.0,0,0.0,0,0.0,,https://weblate.rob006.net/projects/flarum/justoverclock-random-post/eu/,https://weblate.rob006.net/translate/flarum/justoverclock-random-post/eu/,,,0,0,0.0,0,0.0,0,0
Persian,fa,3,0,0.0,0.0,21,0,124,0,0.0,0,0.0,0,0.0,,https://weblate.rob006.net/projects/flarum/justoverclock-random-post/fa/,https://weblate.rob006.net/translate/flarum/justoverclock-random-post/fa/,,,0,0,0.0,0,0.0,0,0
Finnish,fi,3,3,100.0,100.0,21,21,124,124,100.0,0,0.0,0,0.0,,https://weblate.rob006.net/projects/flarum/justoverclock-random-post/fi/,https://weblate.rob006.net/translate/flarum/justoverclock-random-post/fi/,2022-09-09 06:15:47.157440+00:00,,3,0,0.0,0,0.0,0,0
Filipino,fil,3,0,0.0,0.0,21,0,124,0,0.0,0,0.0,0,0.0,,https://weblate.rob006.net/projects/flarum/justoverclock-random-post/fil/,https://weblate.rob006.net/translate/flarum/justoverclock-random-post/fil/,,,0,0,0.0,0,0.0,0,0
French,fr,3,3,100.0,100.0,21,21,124,124,100.0,0,0.0,0,0.0,,https://weblate.rob006.net/projects/flarum/justoverclock-random-post/fr/,https://weblate.rob006.net/translate/flarum/justoverclock-random-post/fr/,2022-05-19 21:44:35.145721+00:00,,5,0,0.0,3,100.0,0,0
Irish,ga,3,0,0.0,0.0,21,0,124,0,0.0,0,0.0,0,0.0,,https://weblate.rob006.net/projects/flarum/justoverclock-random-post/ga/,https://weblate.rob006.net/translate/flarum/justoverclock-random-post/ga/,,,0,0,0.0,0,0.0,0,0
Galician,gl,3,0,0.0,0.0,21,0,124,0,0.0,0,0.0,0,0.0,,https://weblate.rob006.net/projects/flarum/justoverclock-random-post/gl/,https://weblate.rob006.net/translate/flarum/justoverclock-random-post/gl/,,,0,0,0.0,0,0.0,0,0
Hebrew,he,3,0,0.0,0.0,21,0,124,0,0.0,0,0.0,0,0.0,,https://weblate.rob006.net/projects/flarum/justoverclock-random-post/he/,https://weblate.rob006.net/translate/flarum/justoverclock-random-post/he/,,,0,0,0.0,0,0.0,0,0
Hindi,hi,3,0,0.0,0.0,21,0,124,0,0.0,0,0.0,0,0.0,,https://weblate.rob006.net/projects/flarum/justoverclock-random-post/hi/,https://weblate.rob006.net/translate/flarum/justoverclock-random-post/hi/,,,0,0,0.0,0,0.0,0,0
Croatian,hr,3,0,0.0,0.0,21,0,124,0,0.0,0,0.0,0,0.0,,https://weblate.rob006.net/projects/flarum/justoverclock-random-post/hr/,https://weblate.rob006.net/translate/flarum/justoverclock-random-post/hr/,,,0,0,0.0,0,0.0,0,0
Hungarian,hu,3,3,100.0,100.0,21,21,124,124,100.0,0,0.0,0,0.0,,https://weblate.rob006.net/projects/flarum/justoverclock-random-post/hu/,https://weblate.rob006.net/translate/flarum/justoverclock-random-post/hu/,2022-07-12 09:11:06.211803+00:00,,4,0,0.0,3,100.0,0,0
Armenian,hy,3,0,0.0,0.0,21,0,124,0,0.0,0,0.0,0,0.0,,https://weblate.rob006.net/projects/flarum/justoverclock-random-post/hy/,https://weblate.rob006.net/translate/flarum/justoverclock-random-post/hy/,,,0,0,0.0,0,0.0,0,0
Indonesian,id,3,3,100.0,100.0,21,21,124,124,100.0,0,0.0,0,0.0,,https://weblate.rob006.net/projects/flarum/justoverclock-random-post/id/,https://weblate.rob006.net/translate/flarum/justoverclock-random-post/id/,2023-06-02 12:42:28.284440+00:00,,1,0,0.0,2,66.6,0,0
Icelandic,is,3,0,0.0,0.0,21,0,124,0,0.0,0,0.0,0,0.0,,https://weblate.rob006.net/projects/flarum/justoverclock-random-post/is/,https://weblate.rob006.net/translate/flarum/justoverclock-random-post/is/,,,0,0,0.0,0,0.0,0,0
Italian,it,3,0,0.0,0.0,21,0,124,0,0.0,0,0.0,0,0.0,,https://weblate.rob006.net/projects/flarum/justoverclock-random-post/it/,https://weblate.rob006.net/translate/flarum/justoverclock-random-post/it/,,,0,0,0.0,0,0.0,0,0
Japanese,ja,3,0,0.0,0.0,21,0,124,0,0.0,0,0.0,0,0.0,,https://weblate.rob006.net/projects/flarum/justoverclock-random-post/ja/,https://weblate.rob006.net/translate/flarum/justoverclock-random-post/ja/,,,0,0,0.0,0,0.0,0,0
Georgian,ka,3,0,0.0,0.0,21,0,124,0,0.0,0,0.0,0,0.0,,https://weblate.rob006.net/projects/flarum/justoverclock-random-post/ka/,https://weblate.rob006.net/translate/flarum/justoverclock-random-post/ka/,,,0,0,0.0,0,0.0,0,0
Kabyle,kab,3,0,0.0,0.0,21,0,124,0,0.0,0,0.0,0,0.0,,https://weblate.rob006.net/projects/flarum/justoverclock-random-post/kab/,https://weblate.rob006.net/translate/flarum/justoverclock-random-post/kab/,,,0,0,0.0,0,0.0,0,0
Kazakh,kk,3,0,0.0,0.0,21,0,124,0,0.0,0,0.0,0,0.0,,https://weblate.rob006.net/projects/flarum/justoverclock-random-post/kk/,https://weblate.rob006.net/translate/flarum/justoverclock-random-post/kk/,,,0,0,0.0,0,0.0,0,0
Khmer (Central),km,3,0,0.0,0.0,21,0,124,0,0.0,0,0.0,0,0.0,,https://weblate.rob006.net/projects/flarum/justoverclock-random-post/km/,https://weblate.rob006.net/translate/flarum/justoverclock-random-post/km/,,,0,0,0.0,0,0.0,0,0
Kurdish (Northern),kmr,3,0,0.0,0.0,21,0,124,0,0.0,0,0.0,0,0.0,,https://weblate.rob006.net/projects/flarum/justoverclock-random-post/kmr/,https://weblate.rob006.net/translate/flarum/justoverclock-random-post/kmr/,,,0,0,0.0,0,0.0,0,0
Kannada,kn,3,0,0.0,0.0,21,0,124,0,0.0,0,0.0,0,0.0,,https://weblate.rob006.net/projects/flarum/justoverclock-random-post/kn/,https://weblate.rob006.net/translate/flarum/justoverclock-random-post/kn/,,,0,0,0.0,0,0.0,0,0
Korean,ko,3,0,0.0,0.0,21,0,124,0,0.0,0,0.0,0,0.0,,https://weblate.rob006.net/projects/flarum/justoverclock-random-post/ko/,https://weblate.rob006.net/translate/flarum/justoverclock-random-post/ko/,,,0,0,0.0,0,0.0,0,0
Lithuanian,lt,3,0,0.0,0.0,21,0,124,0,0.0,0,0.0,0,0.0,,https://weblate.rob006.net/projects/flarum/justoverclock-random-post/lt/,https://weblate.rob006.net/translate/flarum/justoverclock-random-post/lt/,,,0,0,0.0,0,0.0,0,0
Latvian,lv,3,0,0.0,0.0,21,0,124,0,0.0,0,0.0,0,0.0,,https://weblate.rob006.net/projects/flarum/justoverclock-random-post/lv/,https://weblate.rob006.net/translate/flarum/justoverclock-random-post/lv/,,,0,0,0.0,0,0.0,0,0
Macedonian,mk,3,0,0.0,0.0,21,0,124,0,0.0,0,0.0,0,0.0,,https://weblate.rob006.net/projects/flarum/justoverclock-random-post/mk/,https://weblate.rob006.net/translate/flarum/justoverclock-random-post/mk/,,,0,0,0.0,0,0.0,0,0
Malayalam,ml,3,0,0.0,0.0,21,0,124,0,0.0,0,0.0,0,0.0,,https://weblate.rob006.net/projects/flarum/justoverclock-random-post/ml/,https://weblate.rob006.net/translate/flarum/justoverclock-random-post/ml/,,,0,0,0.0,0,0.0,0,0
Marathi,mr,3,0,0.0,0.0,21,0,124,0,0.0,0,0.0,0,0.0,,https://weblate.rob006.net/projects/flarum/justoverclock-random-post/mr/,https://weblate.rob006.net/translate/flarum/justoverclock-random-post/mr/,,,0,0,0.0,0,0.0,0,0
Burmese,my,3,0,0.0,0.0,21,0,124,0,0.0,0,0.0,0,0.0,,https://weblate.rob006.net/projects/flarum/justoverclock-random-post/my/,https://weblate.rob006.net/translate/flarum/justoverclock-random-post/my/,,,0,0,0.0,0,0.0,0,0
Norwegian Bokmål,nb,3,0,0.0,0.0,21,0,124,0,0.0,0,0.0,0,0.0,,https://weblate.rob006.net/projects/flarum/justoverclock-random-post/nb/,https://weblate.rob006.net/translate/flarum/justoverclock-random-post/nb/,,,0,0,0.0,0,0.0,0,0
Nepali,ne,3,0,0.0,0.0,21,0,124,0,0.0,0,0.0,0,0.0,,https://weblate.rob006.net/projects/flarum/justoverclock-random-post/ne/,https://weblate.rob006.net/translate/flarum/justoverclock-random-post/ne/,,,0,0,0.0,0,0.0,0,0
Dutch,nl,3,0,0.0,0.0,21,0,124,0,0.0,0,0.0,0,0.0,,https://weblate.rob006.net/projects/flarum/justoverclock-random-post/nl/,https://weblate.rob006.net/translate/flarum/justoverclock-random-post/nl/,,,0,0,0.0,0,0.0,0,0
Norwegian Nynorsk,nn,3,0,0.0,0.0,21,0,124,0,0.0,0,0.0,0,0.0,,https://weblate.rob006.net/projects/flarum/justoverclock-random-post/nn/,https://weblate.rob006.net/translate/flarum/justoverclock-random-post/nn/,,,0,0,0.0,0,0.0,0,0
Occitan,oc,3,0,0.0,0.0,21,0,124,0,0.0,0,0.0,0,0.0,,https://weblate.rob006.net/projects/flarum/justoverclock-random-post/oc/,https://weblate.rob006.net/translate/flarum/justoverclock-random-post/oc/,,,0,0,0.0,0,0.0,0,0
Punjabi,pa,3,0,0.0,0.0,21,0,124,0,0.0,0,0.0,0,0.0,,https://weblate.rob006.net/projects/flarum/justoverclock-random-post/pa/,https://weblate.rob006.net/translate/flarum/justoverclock-random-post/pa/,,,0,0,0.0,0,0.0,0,0
Polish,pl,3,0,0.0,0.0,21,0,124,0,0.0,0,0.0,0,0.0,,https://weblate.rob006.net/projects/flarum/justoverclock-random-post/pl/,https://weblate.rob006.net/translate/flarum/justoverclock-random-post/pl/,,,0,0,0.0,0,0.0,0,0
Portuguese,pt,3,0,0.0,0.0,21,0,124,0,0.0,0,0.0,0,0.0,,https://weblate.rob006.net/projects/flarum/justoverclock-random-post/pt/,https://weblate.rob006.net/translate/flarum/justoverclock-random-post/pt/,,,0,0,0.0,0,0.0,0,0
Portuguese (Brazil),pt_BR,3,0,0.0,0.0,21,0,124,0,0.0,0,0.0,0,0.0,,https://weblate.rob006.net/projects/flarum/justoverclock-random-post/pt_BR/,https://weblate.rob006.net/translate/flarum/justoverclock-random-post/pt_BR/,,,0,0,0.0,0,0.0,0,0
Romanian,ro,3,0,0.0,0.0,21,0,124,0,0.0,0,0.0,0,0.0,,https://weblate.rob006.net/projects/flarum/justoverclock-random-post/ro/,https://weblate.rob006.net/translate/flarum/justoverclock-random-post/ro/,,,0,0,0.0,0,0.0,0,0
Russian,ru,3,0,0.0,0.0,21,0,124,0,0.0,0,0.0,0,0.0,,https://weblate.rob006.net/projects/flarum/justoverclock-random-post/ru/,https://weblate.rob006.net/translate/flarum/justoverclock-random-post/ru/,,,0,0,0.0,0,0.0,0,0
Sardinian,sc,3,0,0.0,0.0,21,0,124,0,0.0,0,0.0,0,0.0,,https://weblate.rob006.net/projects/flarum/justoverclock-random-post/sc/,https://weblate.rob006.net/translate/flarum/justoverclock-random-post/sc/,,,0,0,0.0,0,0.0,0,0
Sinhala,si,3,0,0.0,0.0,21,0,124,0,0.0,0,0.0,0,0.0,,https://weblate.rob006.net/projects/flarum/justoverclock-random-post/si/,https://weblate.rob006.net/translate/flarum/justoverclock-random-post/si/,,,0,0,0.0,0,0.0,0,0
Slovak,sk,3,1,33.3,23.8,21,5,124,31,25.0,0,0.0,0,0.0,,https://weblate.rob006.net/projects/flarum/justoverclock-random-post/sk/,https://weblate.rob006.net/translate/flarum/justoverclock-random-post/sk/,2022-08-22 17:30:27.375885+00:00,,2,0,0.0,1,33.3,0,0
Slovenian,sl,3,0,0.0,0.0,21,0,124,0,0.0,0,0.0,0,0.0,,https://weblate.rob006.net/projects/flarum/justoverclock-random-post/sl/,https://weblate.rob006.net/translate/flarum/justoverclock-random-post/sl/,,,0,0,0.0,0,0.0,0,0
Albanian,sq,3,0,0.0,0.0,21,0,124,0,0.0,0,0.0,0,0.0,,https://weblate.rob006.net/projects/flarum/justoverclock-random-post/sq/,https://weblate.rob006.net/translate/flarum/justoverclock-random-post/sq/,,,0,0,0.0,0,0.0,0,0
Serbian (cyrillic),sr_Cyrl,3,0,0.0,0.0,21,0,124,0,0.0,0,0.0,0,0.0,,https://weblate.rob006.net/projects/flarum/justoverclock-random-post/sr_Cyrl/,https://weblate.rob006.net/translate/flarum/justoverclock-random-post/sr_Cyrl/,,,0,0,0.0,0,0.0,0,0
Serbian (latin),sr_Latn,3,0,0.0,0.0,21,0,124,0,0.0,0,0.0,0,0.0,,https://weblate.rob006.net/projects/flarum/justoverclock-random-post/sr_Latn/,https://weblate.rob006.net/translate/flarum/justoverclock-random-post/sr_Latn/,,,0,0,0.0,0,0.0,0,0
Swedish,sv,3,0,0.0,0.0,21,0,124,0,0.0,0,0.0,0,0.0,,https://weblate.rob006.net/projects/flarum/justoverclock-random-post/sv/,https://weblate.rob006.net/translate/flarum/justoverclock-random-post/sv/,,,0,0,0.0,0,0.0,0,0
Tamil,ta,3,0,0.0,0.0,21,0,124,0,0.0,0,0.0,0,0.0,,https://weblate.rob006.net/projects/flarum/justoverclock-random-post/ta/,https://weblate.rob006.net/translate/flarum/justoverclock-random-post/ta/,,,0,0,0.0,0,0.0,0,0
Telugu,te,3,0,0.0,0.0,21,0,124,0,0.0,0,0.0,0,0.0,,https://weblate.rob006.net/projects/flarum/justoverclock-random-post/te/,https://weblate.rob006.net/translate/flarum/justoverclock-random-post/te/,,,0,0,0.0,0,0.0,0,0
Thai,th,3,0,0.0,0.0,21,0,124,0,0.0,0,0.0,0,0.0,,https://weblate.rob006.net/projects/flarum/justoverclock-random-post/th/,https://weblate.rob006.net/translate/flarum/justoverclock-random-post/th/,,,0,0,0.0,0,0.0,0,0
Turkmen,tk,3,0,0.0,0.0,21,0,124,0,0.0,0,0.0,0,0.0,,https://weblate.rob006.net/projects/flarum/justoverclock-random-post/tk/,https://weblate.rob006.net/translate/flarum/justoverclock-random-post/tk/,,,0,0,0.0,0,0.0,0,0
Tagalog,tl,3,0,0.0,0.0,21,0,124,0,0.0,0,0.0,0,0.0,,https://weblate.rob006.net/projects/flarum/justoverclock-random-post/tl/,https://weblate.rob006.net/translate/flarum/justoverclock-random-post/tl/,,,0,0,0.0,0,0.0,0,0
Toki Pona,tok,3,0,0.0,0.0,21,0,124,0,0.0,0,0.0,0,0.0,,https://weblate.rob006.net/projects/flarum/justoverclock-random-post/tok/,https://weblate.rob006.net/translate/flarum/justoverclock-random-post/tok/,,,0,0,0.0,0,0.0,0,0
Turkish,tr,3,3,100.0,100.0,21,21,124,124,100.0,0,0.0,0,0.0,,https://weblate.rob006.net/projects/flarum/justoverclock-random-post/tr/,https://weblate.rob006.net/translate/flarum/justoverclock-random-post/tr/,2022-03-25 05:00:51.055412+00:00,,3,0,0.0,0,0.0,0,0
Uyghur,ug,3,0,0.0,0.0,21,0,124,0,0.0,0,0.0,0,0.0,,https://weblate.rob006.net/projects/flarum/justoverclock-random-post/ug/,https://weblate.rob006.net/translate/flarum/justoverclock-random-post/ug/,,,0,0,0.0,0,0.0,0,0
Ukrainian,uk,3,3,100.0,100.0,21,21,124,124,100.0,0,0.0,0,0.0,,https://weblate.rob006.net/projects/flarum/justoverclock-random-post/uk/,https://weblate.rob006.net/translate/flarum/justoverclock-random-post/uk/,2022-12-01 20:57:16.580764+00:00,,6,0,0.0,3,100.0,0,0
Urdu,ur,3,0,0.0,0.0,21,0,124,0,0.0,0,0.0,0,0.0,,https://weblate.rob006.net/projects/flarum/justoverclock-random-post/ur/,https://weblate.rob006.net/translate/flarum/justoverclock-random-post/ur/,,,0,0,0.0,0,0.0,0,0
Uzbek,uz,3,0,0.0,0.0,21,0,124,0,0.0,0,0.0,0,0.0,,https://weblate.rob006.net/projects/flarum/justoverclock-random-post/uz/,https://weblate.rob006.net/translate/flarum/justoverclock-random-post/uz/,,,0,0,0.0,0,0.0,0,0
Vietnamese,vi,3,3,100.0,100.0,21,21,124,124,100.0,0,0.0,0,0.0,,https://weblate.rob006.net/projects/flarum/justoverclock-random-post/vi/,https://weblate.rob006.net/translate/flarum/justoverclock-random-post/vi/,2022-03-30 16:12:58.513559+00:00,,3,0,0.0,3,100.0,0,0
Chinese (Simplified),zh_Hans,3,3,100.0,100.0,21,21,124,124,100.0,0,0.0,0,0.0,,https://weblate.rob006.net/projects/flarum/justoverclock-random-post/zh_Hans/,https://weblate.rob006.net/translate/flarum/justoverclock-random-post/zh_Hans/,2023-12-18 10:37:11.929441+00:00,,1,0,0.0,0,0.0,0,0
Chinese (Traditional),zh_Hant,3,3,100.0,100.0,21,21,124,124,100.0,0,0.0,0,0.0,,https://weblate.rob006.net/projects/flarum/justoverclock-random-post/zh_Hant/,https://weblate.rob006.net/translate/flarum/justoverclock-random-post/zh_Hant/,2024-02-05 11:02:19.779675+00:00,,2,0,0.0,0,0.0,0,0
