name,code,total,translated,translated_percent,translated_words_percent,total_words,translated_words,total_chars,translated_chars,translated_chars_percent,failing,failing_percent,fuzzy,fuzzy_percent,url_translate,url,translate_url,last_change,last_author,recent_changes,readonly,readonly_percent,approved,approved_percent,suggestions,comments
Afrikaans,af,6,0,0.0,0.0,15,0,136,0,0.0,0,0.0,0,0.0,,https://weblate.rob006.net/projects/flarum/ianm-oauth-reddit/af/,https://weblate.rob006.net/translate/flarum/ianm-oauth-reddit/af/,,,0,0,0.0,0,0.0,0,0
Arabic,ar,6,0,0.0,0.0,15,0,136,0,0.0,0,0.0,0,0.0,,https://weblate.rob006.net/projects/flarum/ianm-oauth-reddit/ar/,https://weblate.rob006.net/translate/flarum/ianm-oauth-reddit/ar/,,,0,0,0.0,0,0.0,0,0
Asturian,ast,6,0,0.0,0.0,15,0,136,0,0.0,0,0.0,0,0.0,,https://weblate.rob006.net/projects/flarum/ianm-oauth-reddit/ast/,https://weblate.rob006.net/translate/flarum/ianm-oauth-reddit/ast/,,,0,0,0.0,0,0.0,0,0
Azerbaijani,az,6,0,0.0,0.0,15,0,136,0,0.0,0,0.0,0,0.0,,https://weblate.rob006.net/projects/flarum/ianm-oauth-reddit/az/,https://weblate.rob006.net/translate/flarum/ianm-oauth-reddit/az/,,,0,0,0.0,0,0.0,0,0
Belarusian,be,6,0,0.0,0.0,15,0,136,0,0.0,0,0.0,0,0.0,,https://weblate.rob006.net/projects/flarum/ianm-oauth-reddit/be/,https://weblate.rob006.net/translate/flarum/ianm-oauth-reddit/be/,,,0,0,0.0,0,0.0,0,0
Bulgarian,bg,6,1,16.6,40.0,15,6,136,38,27.9,0,0.0,2,33.3,,https://weblate.rob006.net/projects/flarum/ianm-oauth-reddit/bg/,https://weblate.rob006.net/translate/flarum/ianm-oauth-reddit/bg/,2023-08-08 13:40:46.245705+00:00,,2,0,0.0,0,0.0,0,0
Bengali,bn,6,0,0.0,0.0,15,0,136,0,0.0,0,0.0,0,0.0,,https://weblate.rob006.net/projects/flarum/ianm-oauth-reddit/bn/,https://weblate.rob006.net/translate/flarum/ianm-oauth-reddit/bn/,,,0,0,0.0,0,0.0,0,0
Breton,br,6,0,0.0,0.0,15,0,136,0,0.0,0,0.0,0,0.0,,https://weblate.rob006.net/projects/flarum/ianm-oauth-reddit/br/,https://weblate.rob006.net/translate/flarum/ianm-oauth-reddit/br/,,,0,0,0.0,0,0.0,0,0
Catalan,ca,6,0,0.0,0.0,15,0,136,0,0.0,0,0.0,0,0.0,,https://weblate.rob006.net/projects/flarum/ianm-oauth-reddit/ca/,https://weblate.rob006.net/translate/flarum/ianm-oauth-reddit/ca/,,,0,0,0.0,0,0.0,0,0
Kurdish (Central),ckb,6,0,0.0,0.0,15,0,136,0,0.0,0,0.0,0,0.0,,https://weblate.rob006.net/projects/flarum/ianm-oauth-reddit/ckb/,https://weblate.rob006.net/translate/flarum/ianm-oauth-reddit/ckb/,,,0,0,0.0,0,0.0,0,0
Czech,cs,6,0,0.0,0.0,15,0,136,0,0.0,0,0.0,0,0.0,,https://weblate.rob006.net/projects/flarum/ianm-oauth-reddit/cs/,https://weblate.rob006.net/translate/flarum/ianm-oauth-reddit/cs/,,,0,0,0.0,0,0.0,0,0
Welsh,cy,6,0,0.0,0.0,15,0,136,0,0.0,0,0.0,0,0.0,,https://weblate.rob006.net/projects/flarum/ianm-oauth-reddit/cy/,https://weblate.rob006.net/translate/flarum/ianm-oauth-reddit/cy/,,,0,0,0.0,0,0.0,0,0
Danish,da,6,0,0.0,0.0,15,0,136,0,0.0,0,0.0,0,0.0,,https://weblate.rob006.net/projects/flarum/ianm-oauth-reddit/da/,https://weblate.rob006.net/translate/flarum/ianm-oauth-reddit/da/,,,0,0,0.0,0,0.0,0,0
German,de,6,0,0.0,0.0,15,0,136,0,0.0,0,0.0,0,0.0,,https://weblate.rob006.net/projects/flarum/ianm-oauth-reddit/de/,https://weblate.rob006.net/translate/flarum/ianm-oauth-reddit/de/,,,0,0,0.0,0,0.0,0,0
German (formal),de@formal,6,0,0.0,0.0,15,0,136,0,0.0,0,0.0,0,0.0,,https://weblate.rob006.net/projects/flarum/ianm-oauth-reddit/de@formal/,https://weblate.rob006.net/translate/flarum/ianm-oauth-reddit/de@formal/,,,0,0,0.0,0,0.0,0,0
Greek,el,6,0,0.0,0.0,15,0,136,0,0.0,0,0.0,0,0.0,,https://weblate.rob006.net/projects/flarum/ianm-oauth-reddit/el/,https://weblate.rob006.net/translate/flarum/ianm-oauth-reddit/el/,,,0,0,0.0,0,0.0,0,0
English,en,6,6,100.0,100.0,15,15,136,136,100.0,1,16.6,0,0.0,,https://weblate.rob006.net/projects/flarum/ianm-oauth-reddit/en/,https://weblate.rob006.net/translate/flarum/ianm-oauth-reddit/en/,,,0,6,100.0,0,0.0,0,0
Esperanto,eo,6,0,0.0,0.0,15,0,136,0,0.0,0,0.0,0,0.0,,https://weblate.rob006.net/projects/flarum/ianm-oauth-reddit/eo/,https://weblate.rob006.net/translate/flarum/ianm-oauth-reddit/eo/,,,0,0,0.0,0,0.0,0,0
Spanish,es,6,0,0.0,0.0,15,0,136,0,0.0,0,0.0,0,0.0,,https://weblate.rob006.net/projects/flarum/ianm-oauth-reddit/es/,https://weblate.rob006.net/translate/flarum/ianm-oauth-reddit/es/,,,0,0,0.0,0,0.0,0,0
Spanish (formal),es@formal,6,0,0.0,0.0,15,0,136,0,0.0,0,0.0,0,0.0,,https://weblate.rob006.net/projects/flarum/ianm-oauth-reddit/es@formal/,https://weblate.rob006.net/translate/flarum/ianm-oauth-reddit/es@formal/,,,0,0,0.0,0,0.0,0,0
Spanish (Argentina),es_AR,6,0,0.0,0.0,15,0,136,0,0.0,0,0.0,0,0.0,,https://weblate.rob006.net/projects/flarum/ianm-oauth-reddit/es_AR/,https://weblate.rob006.net/translate/flarum/ianm-oauth-reddit/es_AR/,,,0,0,0.0,0,0.0,0,0
Estonian,et,6,0,0.0,0.0,15,0,136,0,0.0,0,0.0,0,0.0,,https://weblate.rob006.net/projects/flarum/ianm-oauth-reddit/et/,https://weblate.rob006.net/translate/flarum/ianm-oauth-reddit/et/,,,0,0,0.0,0,0.0,0,0
Basque,eu,6,0,0.0,0.0,15,0,136,0,0.0,0,0.0,0,0.0,,https://weblate.rob006.net/projects/flarum/ianm-oauth-reddit/eu/,https://weblate.rob006.net/translate/flarum/ianm-oauth-reddit/eu/,,,0,0,0.0,0,0.0,0,0
Persian,fa,6,0,0.0,0.0,15,0,136,0,0.0,0,0.0,0,0.0,,https://weblate.rob006.net/projects/flarum/ianm-oauth-reddit/fa/,https://weblate.rob006.net/translate/flarum/ianm-oauth-reddit/fa/,,,0,0,0.0,0,0.0,0,0
Finnish,fi,6,6,100.0,100.0,15,15,136,136,100.0,0,0.0,0,0.0,,https://weblate.rob006.net/projects/flarum/ianm-oauth-reddit/fi/,https://weblate.rob006.net/translate/flarum/ianm-oauth-reddit/fi/,2023-03-24 06:41:24.208830+00:00,,6,0,0.0,5,83.3,0,0
Filipino,fil,6,0,0.0,0.0,15,0,136,0,0.0,0,0.0,0,0.0,,https://weblate.rob006.net/projects/flarum/ianm-oauth-reddit/fil/,https://weblate.rob006.net/translate/flarum/ianm-oauth-reddit/fil/,,,0,0,0.0,0,0.0,0,0
French,fr,6,6,100.0,100.0,15,15,136,136,100.0,0,0.0,0,0.0,,https://weblate.rob006.net/projects/flarum/ianm-oauth-reddit/fr/,https://weblate.rob006.net/translate/flarum/ianm-oauth-reddit/fr/,2023-02-01 20:45:05.056590+00:00,,6,0,0.0,6,100.0,0,0
Irish,ga,6,0,0.0,0.0,15,0,136,0,0.0,0,0.0,0,0.0,,https://weblate.rob006.net/projects/flarum/ianm-oauth-reddit/ga/,https://weblate.rob006.net/translate/flarum/ianm-oauth-reddit/ga/,,,0,0,0.0,0,0.0,0,0
Galician,gl,6,0,0.0,0.0,15,0,136,0,0.0,0,0.0,0,0.0,,https://weblate.rob006.net/projects/flarum/ianm-oauth-reddit/gl/,https://weblate.rob006.net/translate/flarum/ianm-oauth-reddit/gl/,,,0,0,0.0,0,0.0,0,0
Hebrew,he,6,0,0.0,0.0,15,0,136,0,0.0,0,0.0,0,0.0,,https://weblate.rob006.net/projects/flarum/ianm-oauth-reddit/he/,https://weblate.rob006.net/translate/flarum/ianm-oauth-reddit/he/,,,0,0,0.0,0,0.0,0,0
Hindi,hi,6,0,0.0,0.0,15,0,136,0,0.0,0,0.0,0,0.0,,https://weblate.rob006.net/projects/flarum/ianm-oauth-reddit/hi/,https://weblate.rob006.net/translate/flarum/ianm-oauth-reddit/hi/,,,0,0,0.0,0,0.0,0,0
Croatian,hr,6,0,0.0,0.0,15,0,136,0,0.0,0,0.0,0,0.0,,https://weblate.rob006.net/projects/flarum/ianm-oauth-reddit/hr/,https://weblate.rob006.net/translate/flarum/ianm-oauth-reddit/hr/,,,0,0,0.0,0,0.0,0,0
Hungarian,hu,6,6,100.0,100.0,15,15,136,136,100.0,0,0.0,0,0.0,,https://weblate.rob006.net/projects/flarum/ianm-oauth-reddit/hu/,https://weblate.rob006.net/translate/flarum/ianm-oauth-reddit/hu/,2023-08-16 15:15:31.984233+00:00,,6,0,0.0,6,100.0,0,0
Armenian,hy,6,0,0.0,0.0,15,0,136,0,0.0,0,0.0,0,0.0,,https://weblate.rob006.net/projects/flarum/ianm-oauth-reddit/hy/,https://weblate.rob006.net/translate/flarum/ianm-oauth-reddit/hy/,,,0,0,0.0,0,0.0,0,0
Indonesian,id,6,6,100.0,100.0,15,15,136,136,100.0,0,0.0,0,0.0,,https://weblate.rob006.net/projects/flarum/ianm-oauth-reddit/id/,https://weblate.rob006.net/translate/flarum/ianm-oauth-reddit/id/,2023-06-13 08:56:18.932987+00:00,,3,0,0.0,4,66.6,0,0
Icelandic,is,6,0,0.0,0.0,15,0,136,0,0.0,0,0.0,0,0.0,,https://weblate.rob006.net/projects/flarum/ianm-oauth-reddit/is/,https://weblate.rob006.net/translate/flarum/ianm-oauth-reddit/is/,,,0,0,0.0,0,0.0,0,0
Italian,it,6,0,0.0,0.0,15,0,136,0,0.0,0,0.0,0,0.0,,https://weblate.rob006.net/projects/flarum/ianm-oauth-reddit/it/,https://weblate.rob006.net/translate/flarum/ianm-oauth-reddit/it/,,,0,0,0.0,0,0.0,0,0
Japanese,ja,6,0,0.0,0.0,15,0,136,0,0.0,0,0.0,0,0.0,,https://weblate.rob006.net/projects/flarum/ianm-oauth-reddit/ja/,https://weblate.rob006.net/translate/flarum/ianm-oauth-reddit/ja/,,,0,0,0.0,0,0.0,0,0
Georgian,ka,6,0,0.0,0.0,15,0,136,0,0.0,0,0.0,0,0.0,,https://weblate.rob006.net/projects/flarum/ianm-oauth-reddit/ka/,https://weblate.rob006.net/translate/flarum/ianm-oauth-reddit/ka/,,,0,0,0.0,0,0.0,0,0
Kabyle,kab,6,0,0.0,0.0,15,0,136,0,0.0,0,0.0,0,0.0,,https://weblate.rob006.net/projects/flarum/ianm-oauth-reddit/kab/,https://weblate.rob006.net/translate/flarum/ianm-oauth-reddit/kab/,,,0,0,0.0,0,0.0,0,0
Kazakh,kk,6,0,0.0,0.0,15,0,136,0,0.0,0,0.0,0,0.0,,https://weblate.rob006.net/projects/flarum/ianm-oauth-reddit/kk/,https://weblate.rob006.net/translate/flarum/ianm-oauth-reddit/kk/,,,0,0,0.0,0,0.0,0,0
Khmer (Central),km,6,0,0.0,0.0,15,0,136,0,0.0,0,0.0,0,0.0,,https://weblate.rob006.net/projects/flarum/ianm-oauth-reddit/km/,https://weblate.rob006.net/translate/flarum/ianm-oauth-reddit/km/,,,0,0,0.0,0,0.0,0,0
Kurdish (Northern),kmr,6,0,0.0,0.0,15,0,136,0,0.0,0,0.0,0,0.0,,https://weblate.rob006.net/projects/flarum/ianm-oauth-reddit/kmr/,https://weblate.rob006.net/translate/flarum/ianm-oauth-reddit/kmr/,,,0,0,0.0,0,0.0,0,0
Kannada,kn,6,0,0.0,0.0,15,0,136,0,0.0,0,0.0,0,0.0,,https://weblate.rob006.net/projects/flarum/ianm-oauth-reddit/kn/,https://weblate.rob006.net/translate/flarum/ianm-oauth-reddit/kn/,,,0,0,0.0,0,0.0,0,0
Korean,ko,6,0,0.0,0.0,15,0,136,0,0.0,0,0.0,0,0.0,,https://weblate.rob006.net/projects/flarum/ianm-oauth-reddit/ko/,https://weblate.rob006.net/translate/flarum/ianm-oauth-reddit/ko/,,,0,0,0.0,0,0.0,0,0
Lithuanian,lt,6,0,0.0,0.0,15,0,136,0,0.0,0,0.0,0,0.0,,https://weblate.rob006.net/projects/flarum/ianm-oauth-reddit/lt/,https://weblate.rob006.net/translate/flarum/ianm-oauth-reddit/lt/,,,0,0,0.0,0,0.0,0,0
Latvian,lv,6,0,0.0,0.0,15,0,136,0,0.0,0,0.0,0,0.0,,https://weblate.rob006.net/projects/flarum/ianm-oauth-reddit/lv/,https://weblate.rob006.net/translate/flarum/ianm-oauth-reddit/lv/,,,0,0,0.0,0,0.0,0,0
Macedonian,mk,6,0,0.0,0.0,15,0,136,0,0.0,0,0.0,0,0.0,,https://weblate.rob006.net/projects/flarum/ianm-oauth-reddit/mk/,https://weblate.rob006.net/translate/flarum/ianm-oauth-reddit/mk/,,,0,0,0.0,0,0.0,0,0
Malayalam,ml,6,0,0.0,0.0,15,0,136,0,0.0,0,0.0,0,0.0,,https://weblate.rob006.net/projects/flarum/ianm-oauth-reddit/ml/,https://weblate.rob006.net/translate/flarum/ianm-oauth-reddit/ml/,,,0,0,0.0,0,0.0,0,0
Marathi,mr,6,0,0.0,0.0,15,0,136,0,0.0,0,0.0,0,0.0,,https://weblate.rob006.net/projects/flarum/ianm-oauth-reddit/mr/,https://weblate.rob006.net/translate/flarum/ianm-oauth-reddit/mr/,,,0,0,0.0,0,0.0,0,0
Burmese,my,6,0,0.0,0.0,15,0,136,0,0.0,0,0.0,0,0.0,,https://weblate.rob006.net/projects/flarum/ianm-oauth-reddit/my/,https://weblate.rob006.net/translate/flarum/ianm-oauth-reddit/my/,,,0,0,0.0,0,0.0,0,0
Norwegian Bokmål,nb,6,0,0.0,0.0,15,0,136,0,0.0,0,0.0,0,0.0,,https://weblate.rob006.net/projects/flarum/ianm-oauth-reddit/nb/,https://weblate.rob006.net/translate/flarum/ianm-oauth-reddit/nb/,,,0,0,0.0,0,0.0,0,0
Nepali,ne,6,0,0.0,0.0,15,0,136,0,0.0,0,0.0,0,0.0,,https://weblate.rob006.net/projects/flarum/ianm-oauth-reddit/ne/,https://weblate.rob006.net/translate/flarum/ianm-oauth-reddit/ne/,,,0,0,0.0,0,0.0,0,0
Dutch,nl,6,0,0.0,0.0,15,0,136,0,0.0,0,0.0,0,0.0,,https://weblate.rob006.net/projects/flarum/ianm-oauth-reddit/nl/,https://weblate.rob006.net/translate/flarum/ianm-oauth-reddit/nl/,,,0,0,0.0,0,0.0,0,0
Norwegian Nynorsk,nn,6,0,0.0,0.0,15,0,136,0,0.0,0,0.0,0,0.0,,https://weblate.rob006.net/projects/flarum/ianm-oauth-reddit/nn/,https://weblate.rob006.net/translate/flarum/ianm-oauth-reddit/nn/,,,0,0,0.0,0,0.0,0,0
Occitan,oc,6,0,0.0,0.0,15,0,136,0,0.0,0,0.0,0,0.0,,https://weblate.rob006.net/projects/flarum/ianm-oauth-reddit/oc/,https://weblate.rob006.net/translate/flarum/ianm-oauth-reddit/oc/,,,0,0,0.0,0,0.0,0,0
Punjabi,pa,6,0,0.0,0.0,15,0,136,0,0.0,0,0.0,0,0.0,,https://weblate.rob006.net/projects/flarum/ianm-oauth-reddit/pa/,https://weblate.rob006.net/translate/flarum/ianm-oauth-reddit/pa/,,,0,0,0.0,0,0.0,0,0
Polish,pl,6,0,0.0,0.0,15,0,136,0,0.0,0,0.0,0,0.0,,https://weblate.rob006.net/projects/flarum/ianm-oauth-reddit/pl/,https://weblate.rob006.net/translate/flarum/ianm-oauth-reddit/pl/,,,0,0,0.0,0,0.0,0,0
Portuguese,pt,6,0,0.0,0.0,15,0,136,0,0.0,0,0.0,0,0.0,,https://weblate.rob006.net/projects/flarum/ianm-oauth-reddit/pt/,https://weblate.rob006.net/translate/flarum/ianm-oauth-reddit/pt/,,,0,0,0.0,0,0.0,0,0
Portuguese (Brazil),pt_BR,6,0,0.0,0.0,15,0,136,0,0.0,0,0.0,0,0.0,,https://weblate.rob006.net/projects/flarum/ianm-oauth-reddit/pt_BR/,https://weblate.rob006.net/translate/flarum/ianm-oauth-reddit/pt_BR/,,,0,0,0.0,0,0.0,0,0
Romanian,ro,6,0,0.0,0.0,15,0,136,0,0.0,0,0.0,0,0.0,,https://weblate.rob006.net/projects/flarum/ianm-oauth-reddit/ro/,https://weblate.rob006.net/translate/flarum/ianm-oauth-reddit/ro/,,,0,0,0.0,0,0.0,0,0
Russian,ru,6,0,0.0,0.0,15,0,136,0,0.0,0,0.0,0,0.0,,https://weblate.rob006.net/projects/flarum/ianm-oauth-reddit/ru/,https://weblate.rob006.net/translate/flarum/ianm-oauth-reddit/ru/,,,0,0,0.0,0,0.0,0,0
Sardinian,sc,6,0,0.0,0.0,15,0,136,0,0.0,0,0.0,0,0.0,,https://weblate.rob006.net/projects/flarum/ianm-oauth-reddit/sc/,https://weblate.rob006.net/translate/flarum/ianm-oauth-reddit/sc/,,,0,0,0.0,0,0.0,0,0
Sinhala,si,6,0,0.0,0.0,15,0,136,0,0.0,0,0.0,0,0.0,,https://weblate.rob006.net/projects/flarum/ianm-oauth-reddit/si/,https://weblate.rob006.net/translate/flarum/ianm-oauth-reddit/si/,,,0,0,0.0,0,0.0,0,0
Slovak,sk,6,0,0.0,0.0,15,0,136,0,0.0,0,0.0,0,0.0,,https://weblate.rob006.net/projects/flarum/ianm-oauth-reddit/sk/,https://weblate.rob006.net/translate/flarum/ianm-oauth-reddit/sk/,,,0,0,0.0,0,0.0,0,0
Slovenian,sl,6,0,0.0,0.0,15,0,136,0,0.0,0,0.0,0,0.0,,https://weblate.rob006.net/projects/flarum/ianm-oauth-reddit/sl/,https://weblate.rob006.net/translate/flarum/ianm-oauth-reddit/sl/,,,0,0,0.0,0,0.0,0,0
Albanian,sq,6,0,0.0,0.0,15,0,136,0,0.0,0,0.0,0,0.0,,https://weblate.rob006.net/projects/flarum/ianm-oauth-reddit/sq/,https://weblate.rob006.net/translate/flarum/ianm-oauth-reddit/sq/,,,0,0,0.0,0,0.0,0,0
Serbian (cyrillic),sr_Cyrl,6,0,0.0,0.0,15,0,136,0,0.0,0,0.0,0,0.0,,https://weblate.rob006.net/projects/flarum/ianm-oauth-reddit/sr_Cyrl/,https://weblate.rob006.net/translate/flarum/ianm-oauth-reddit/sr_Cyrl/,,,0,0,0.0,0,0.0,0,0
Serbian (latin),sr_Latn,6,0,0.0,0.0,15,0,136,0,0.0,0,0.0,0,0.0,,https://weblate.rob006.net/projects/flarum/ianm-oauth-reddit/sr_Latn/,https://weblate.rob006.net/translate/flarum/ianm-oauth-reddit/sr_Latn/,,,0,0,0.0,0,0.0,0,0
Swedish,sv,6,0,0.0,0.0,15,0,136,0,0.0,0,0.0,0,0.0,,https://weblate.rob006.net/projects/flarum/ianm-oauth-reddit/sv/,https://weblate.rob006.net/translate/flarum/ianm-oauth-reddit/sv/,,,0,0,0.0,0,0.0,0,0
Tamil,ta,6,0,0.0,0.0,15,0,136,0,0.0,0,0.0,0,0.0,,https://weblate.rob006.net/projects/flarum/ianm-oauth-reddit/ta/,https://weblate.rob006.net/translate/flarum/ianm-oauth-reddit/ta/,,,0,0,0.0,0,0.0,0,0
Telugu,te,6,0,0.0,0.0,15,0,136,0,0.0,0,0.0,0,0.0,,https://weblate.rob006.net/projects/flarum/ianm-oauth-reddit/te/,https://weblate.rob006.net/translate/flarum/ianm-oauth-reddit/te/,,,0,0,0.0,0,0.0,0,0
Thai,th,6,0,0.0,0.0,15,0,136,0,0.0,0,0.0,0,0.0,,https://weblate.rob006.net/projects/flarum/ianm-oauth-reddit/th/,https://weblate.rob006.net/translate/flarum/ianm-oauth-reddit/th/,,,0,0,0.0,0,0.0,0,0
Turkmen,tk,6,0,0.0,0.0,15,0,136,0,0.0,0,0.0,0,0.0,,https://weblate.rob006.net/projects/flarum/ianm-oauth-reddit/tk/,https://weblate.rob006.net/translate/flarum/ianm-oauth-reddit/tk/,,,0,0,0.0,0,0.0,0,0
Tagalog,tl,6,0,0.0,0.0,15,0,136,0,0.0,0,0.0,0,0.0,,https://weblate.rob006.net/projects/flarum/ianm-oauth-reddit/tl/,https://weblate.rob006.net/translate/flarum/ianm-oauth-reddit/tl/,,,0,0,0.0,0,0.0,0,0
Toki Pona,tok,6,0,0.0,0.0,15,0,136,0,0.0,0,0.0,0,0.0,,https://weblate.rob006.net/projects/flarum/ianm-oauth-reddit/tok/,https://weblate.rob006.net/translate/flarum/ianm-oauth-reddit/tok/,,,0,0,0.0,0,0.0,0,0
Turkish,tr,6,6,100.0,100.0,15,15,136,136,100.0,0,0.0,0,0.0,,https://weblate.rob006.net/projects/flarum/ianm-oauth-reddit/tr/,https://weblate.rob006.net/translate/flarum/ianm-oauth-reddit/tr/,2023-01-30 13:29:39.317716+00:00,,6,0,0.0,6,100.0,0,0
Uyghur,ug,6,0,0.0,0.0,15,0,136,0,0.0,0,0.0,0,0.0,,https://weblate.rob006.net/projects/flarum/ianm-oauth-reddit/ug/,https://weblate.rob006.net/translate/flarum/ianm-oauth-reddit/ug/,,,0,0,0.0,0,0.0,0,0
Ukrainian,uk,6,6,100.0,100.0,15,15,136,136,100.0,1,16.6,0,0.0,,https://weblate.rob006.net/projects/flarum/ianm-oauth-reddit/uk/,https://weblate.rob006.net/translate/flarum/ianm-oauth-reddit/uk/,2023-02-27 09:19:12.583491+00:00,,15,0,0.0,6,100.0,0,0
Urdu,ur,6,0,0.0,0.0,15,0,136,0,0.0,0,0.0,0,0.0,,https://weblate.rob006.net/projects/flarum/ianm-oauth-reddit/ur/,https://weblate.rob006.net/translate/flarum/ianm-oauth-reddit/ur/,,,0,0,0.0,0,0.0,0,0
Uzbek,uz,6,0,0.0,0.0,15,0,136,0,0.0,0,0.0,0,0.0,,https://weblate.rob006.net/projects/flarum/ianm-oauth-reddit/uz/,https://weblate.rob006.net/translate/flarum/ianm-oauth-reddit/uz/,,,0,0,0.0,0,0.0,0,0
Vietnamese,vi,6,6,100.0,100.0,15,15,136,136,100.0,0,0.0,0,0.0,,https://weblate.rob006.net/projects/flarum/ianm-oauth-reddit/vi/,https://weblate.rob006.net/translate/flarum/ianm-oauth-reddit/vi/,2023-03-12 14:00:22.973546+00:00,,6,0,0.0,6,100.0,0,0
Chinese (Simplified),zh_Hans,6,4,66.6,80.0,15,12,136,97,71.3,0,0.0,0,0.0,,https://weblate.rob006.net/projects/flarum/ianm-oauth-reddit/zh_Hans/,https://weblate.rob006.net/translate/flarum/ianm-oauth-reddit/zh_Hans/,2024-02-05 16:51:02.389255+00:00,,1,0,0.0,0,0.0,0,0
Chinese (Traditional),zh_Hant,6,6,100.0,100.0,15,15,136,136,100.0,0,0.0,0,0.0,,https://weblate.rob006.net/projects/flarum/ianm-oauth-reddit/zh_Hant/,https://weblate.rob006.net/translate/flarum/ianm-oauth-reddit/zh_Hant/,2023-01-31 01:39:41.319053+00:00,,7,0,0.0,0,0.0,0,0
